Regulation Heading
type: Class
alternative label: 法规标题
subclass of: RBQwuwI8kIy4gvRmoiZHA5m
definition: Regulation Heading refers to a subcategory of Invoice Data that pertains to the specific regulations or laws that apply to the services provided and billed for in an engagement.