Right to Encumber Clause
type: Class
alternative label: 设定负担权条款
subclass of: RDe0RKU39BlhcyACJW30ZLc
definition: A Right to Encumber Clause is a provision in a contract that grants the right to create a lien or mortgage on the subject property as security for a debt or obligation.