Education Law
type: Class
alternative label: 教育法
subclass of: RSYBzf149Mi5KE0YtmpUmr
hidden label: EDUC
definition: The body of state and federal law that covers teachers, schools, school districts, school boards, and the students they teach.