Guatemala (subdivision of Guatemala)
type: Class
preferred label: Guatemala
alternative label: subdivision of Guatemala
alternative label: GT+GU
subclass of: REE94a4C67f17EFCc9b0E343
hidden label: GT+GU
definition: A subdivision of Guatemala, which refers to a specific region or administrative area within the country.