New York Civil Court - Richmond County
type: Class
subclass of: RyP4THD1q0s9GhYijVhWuf
definition: New York Civil Court - Richmond County is a specific court within the New York Civil Court system that handles civil cases in Richmond County.