Cumulative Rights Clause
type: Class
alternative label: 累积权利条款
subclass of: RDe0RKU39BlhcyACJW30ZLc
definition: A Cumulative Rights Clause is a provision in a contract that allows a party to exercise all of their rights and remedies under the contract, in addition to any other rights and remedies available under the law.