Tax Return Privilege
type: Class
alternative label: 纳税申报特权
subclass of: Rxkyjui3De88JNN2ZCqKrt
definition: The Tax Return Privilege is a legal protection that allows a taxpayer to keep their tax information confidential and prevents the government from compelling disclosure of that information.