HHS Office of the Inspector General
type: Class
alternative label: HHS检察长办公室
subclass of: RDA5e5cC4E75f969fbe25383
hidden label: HHSOIG
definition: Office of Inspector General's (OIG) mission is to protect the integrity of Department of Health & Human Services (HHS) programs as well as the health and welfare of program beneficiaries.