Mukono
type: Class
alternative label: UG+108
subclass of: R8680cbB69cf63001936Bffe
hidden label: UG+108
definition: Mukono is a location in Uganda, which is a political subdivision of the African continent.