Accounts Receivable
type: Class
preferred label: Contractual Obligations
alternative label: 合同义务
subclass of: RnfzkAKrjy32YoweXnzDjp
subclass of: RxkTKgYqWS0WBHnJgrn27Y
definition: Bilateral obligations (e.g., financial, equitable) are legally-binding responsibilities that parties agree to perform under the terms of agreements (e.g., lease agreements, commercial agreements) are used by various legal processes (e.g., Bankruptcy). THIS IS A PROPOSAL, SUBJECT TO REVIEW.