Governmental Criminal Law Division
type: Class
alternative label: Criminal Justice Division
alternative label: District Attorney's Office
alternative label: Federal Prosecutor's Office
alternative label: Government Criminal Prosecution Office
alternative label: Prosecutor's Office
alternative label: Public Prosecutor's Office
alternative label: State Attorney's Office
alternative label: State Prosecutor's Office
subclass of: RBt449Gy4YQBuVqNLxE7Gg
definition: A Governmental Criminal Law Division is a government entity responsible for prosecuting criminal cases on behalf of the public. It conducts investigations, files charges, represents the government in criminal trials, and ensures the enforcement of criminal laws.