Registration
type: Class
alternative label: 注册
subclass of: RCvV18Mbbb9FYFXbHt1inuL
subclass of: RdfKnWpXsG2eBmnS3oJNTF
definition: Registration refers to the act of recording or enrolling an individual or entity in a system or database, and is a type of transaction event.