U.S. Small Business Administration
type: Class
preferred label: Small Business Administration
alternative label: 美国小型企业管理局
subclass of: R22815eC3Af3bFF0d002Ca58
hidden label: SBA
definition: The U.S. Small Business Administration (SBA) is a federal agency responsible for providing support to small businesses in the United States, including access to capital, entrepreneurial development, and government contracting.