Siliana
type: Class
alternative label: TN+34
subclass of: RFD8a9187822a09B6c06479f
hidden label: TN+34
definition: Siliana is a city located in the country of Tunisia, specifically in the TN+34 region.