Maryland (Republic of)
type: Class
alternative label: Republic of Maryland
alternative label: LR+MY
subclass of: RDD6d1375E1ffD977d6C81c9
hidden label: LR+MY
definition: Maryland (Republic of) is a political subdivision located in Liberia.