Idaho State Courts
type: Class
alternative label: ID
subclass of: R1F4dbe4CD17b3B2a7f15b97
hidden label: ID
definition: Idaho State Courts are the judicial branch of the Idaho state government, consisting of various courts such as the Idaho Supreme Court and Idaho Magistrate Court.