Sakhalinskaya oblast'
type: Class
alternative label: RU+SAK
subclass of: R53E5e3A8871d86E4f7D1166
hidden label: RU+SAK
definition: Sakhalinskaya oblast' refers to a region in the Russian Federation located in the Far East, adjacent to Japan.