Bankruptcy Court
type: Class
subclass of: R9sbuHkJC9aqDlHAgw58VSB
definition: A Bankruptcy Court is a specialized court that deals with cases related to individuals or businesses that are unable to pay their debts and seek relief under the bankruptcy code.