Trial Court Created Documents
type: Class
alternative label: 一审法院创建的文件
subclass of: R7zvYKadqTXgMZV8ghLsloR
definition: Trial Court Created Documents are written or drawn representations of thought or expression, including evidence such as recordings and other artifacts, that are specifically created by a trial court during the course of legal proceedings.