Motion for Withdrawal of Reference
type: Class
alternative label: 撤回参照动议
subclass of: R9Ii4OzSADsjS0VegX12oQJ
definition: A Motion for Withdrawal of Reference is a request made in a bankruptcy case to transfer the case from the bankruptcy court to the district court for adjudication.