Georgia Superior Court - Tift County
type: Class
subclass of: RCBE5bLTCIia7wAstjMsnKO
definition: Georgia Superior Court - Tift County: A specific court within the Georgia Superior Court system that has jurisdiction over civil and criminal cases in Tift County, Georgia.