Oregon Circuit Court - Jefferson County
type: Class
subclass of: RmGrykg1NdiaxO77n1a1lc
definition: Oregon Circuit Court - Jefferson County: A specific court within the Oregon Circuit Court system that has jurisdiction over legal proceedings in Jefferson County, Oregon.