Presentation
type: Class
preferred label: Slides
alternative label: 演示
subclass of: RTPFix1eiYqgdushRunICo
definition: A descriptive or persuasive account, usually made to a group (e.g., conference, committee).