Individual Person
type: Class
preferred label: Human
alternative label: 自然人
subclass of: R7L5eLIzH0CpOUE74uJvSjL
hidden label: INDV
definition: An individual or natural person is a person that is an individual human being, as opposed to a legal person or entity, which may be a private or public organization.