Matter Management Management
type: Class
subclass of: ROb7P1zmS9dqMfXoFzhfu6
definition: Matter Management is the process of organizing and handling legal cases and related documents, tasks, and communications within a law firm or legal department.