Conflict Prevention and Resolution
type: Class
alternative label: CPR
subclass of: R79PjJAgjkeMLhYBvJMiHNo
definition: Conflict Prevention and Resolution (CPR) is an Alternative Dispute Resolution (ADR) Venue