Motion to Submit Case on Briefs
type: Class
alternative label: 提交书面陈述的案件提交动议
subclass of: R9Zr3p1tJH4I9nJWtNMVz5I
definition: A Motion to Submit Case on Briefs is a request made to the court to decide a case based solely on the written arguments presented by the parties, without any oral arguments.