Missouri Circuit Court
type: Class
subclass of: R932ca6C393ab2B6b1a40173
definition: Missouri Circuit Court is a court of general jurisdiction in the state of Missouri that hears civil and criminal cases.