Expert Interviews
type: Class
alternative label: 专家访谈
subclass of: R83QdGrsILzbGVfk0bqF1kw
definition: Expert Interviews refer to a type of interview conducted by a person with specialized knowledge or skill in a particular field or subject matter.