Bureau of Labor Statistics
type: Class
alternative label: 劳工统计局
subclass of: R15Bf89EBBcdd05Ca4462a0b
hidden label: BLS
definition: The Bureau of Labor Statistics (BLS) is a unit of the United States Department of Labor. It is the principal fact-finding agency for the U.S. government in the broad field of labor economics and statistics and serves as a principal agency of the U.S. Federal Statistical System.