Public Utility Liability
type: Class
alternative label: 公用事业责任
subclass of: R9b5fs8QJuliSZYeaJLJU2t
definition: Public Utility Liability is the legal responsibility of a utility company for any harm caused to the public due to their actions or negligence, and falls under the categories of agency and vicarious liability.