Prisoner Trust Fund Account Statement
type: Class
alternative label: 囚犯信托基金账户报表
subclass of: R7wLLoc6H1zcuVpchb4e5lQ
definition: A Prisoner Trust Fund Account Statement is a financial record of an inmate's account that holds money earned or received while incarcerated, used for purchasing items from the prison commissary or for other approved expenses.