Appearance
type: Class
alternative label: दिखावट
subclass of: R73Uo5x4VyfiOXt6i4R256t
definition: Appearance refers to a litigation event where a party or their representative appears before a court or tribunal.