Experience Management
type: Class
subclass of: R8HLLl44Pya8Fp0uN3ewKRW
definition: Experience Management is the process of capturing, sharing, and utilizing knowledge gained through practical application and personal involvement, within the broader context of Knowledge Management.