Direct-Examination of Witness
type: Class
alternative label: 证人直接询问
subclass of: R7PPywVywQYcT4GloerUeuh
subclass of: R7R1YAozFcvfvIX32msHyay
definition: The Direct-Examination of Witness is a legal practice that involves questioning a witness by the party who called them to testify, in order to elicit testimony that supports their case.