Technical Analysis
type: Class
alternative label: 技术分析
subclass of: RVZJBUCRB7cgWN1CIbeJJq
definition: Technical Analysis refers to the process of examining and evaluating technical data and information in order to draw conclusions and make recommendations in the context of a legal matter, and is a subcategory of Fact Investigation and Development.