Alternative Dispute Resolution Events
type: Class
preferred label: ADR Events
alternative label: 替代性争议解决事件
subclass of: RDFhtJuTWcY7UZGV9F5yOoA
definition: Alternative Dispute Resolution (ADR) Events refer to the events or phases involved in resolving legal disputes outside of traditional litigation, including arbitration and mediation.