Intentional Interference with Prospective Business Relationship
type: Class
alternative label: 故意干涉预期商业关系
subclass of: RDo81N034NYuEZm3nSNabUV
definition: Intentional Interference with Prospective Business Relationship: A tort where a third party intentionally disrupts a business relationship that is likely to occur, causing economic harm to the plaintiff.