Antitrust - Vertical Price Fixing Claims
type: Class
alternative label: 反垄断 - 垂直价格固定索赔
subclass of: R8jiyejSsdOkKDAWQ9ZPcjj
definition: An allegation of illegal collusion between parties at different levels of a supply chain to set prices for goods or services, in violation of antitrust laws.