Enforceability Representation
type: Class
alternative label: 可执行性陈述
subclass of: R9rCNhUCohkUGbQyd1C3uzz
definition: Enforceability Representation: A statement made in a legal agreement that assures the parties involved that the terms of the agreement can be enforced by law.