Georgia Superior Court - Decatur County
type: Class
subclass of: RCBE5bLTCIia7wAstjMsnKO
definition: A court of general jurisdiction in Georgia that has authority over civil and criminal cases within Decatur County.