Unemployment Benefits Law
type: Class
alternative label: 失业救济法
subclass of: RCzvtNXIrDJF8xkmOoc6JKH
hidden label: UNBE
definition: Unemployment benefits refer to those benefits given by the government to unemployed persons.