Massachusetts Superior Court - Middlesex County
type: Class
subclass of: RC183ad9FF4a9997835C1019
definition: The Massachusetts Superior Court - Middlesex County is a court of general jurisdiction in Massachusetts that hears civil and criminal cases within Middlesex County.