Procedural Claims
type: Class
alternative label: 程序性要求
subclass of: R8jYAnNATrfoBxAtIKpf72X
definition: Procedural Claims are legal claims that relate to the process of a lawsuit, such as jurisdiction, venue, or intervention, rather than the substantive issues of the case.