Kansas District Court - Labette County, Oswego
type: Class
subclass of: R8ahGaNbVpIwATBsrRg3EZp
definition: A court located in Labette County, Oswego, Kansas that has jurisdiction over certain legal matters within its geographical area.