Joy
type: Class
alternative label: Bliss
alternative label: Contentment
alternative label: Delight
alternative label: Elation
alternative label: Jubilation
subclass of: R66kux3H2uERxPz0E7KxtN
definition: Joy is an emotion of great pleasure or happiness, often resulting from success, good fortune, or a sense of well-being.