Supplemental Jurisdiction
type: Class
alternative label: 补充管辖权
subclass of: ReswYRsH8IbmoE68QpgOCd
definition: Supplemental Jurisdiction refers to the authority of a court to hear and decide on claims that are related to the original claim, but may not fall under the court's primary jurisdiction.