Motion for Royalty
type: Class
alternative label: 版税动议
subclass of: R8zwKGkogGKIKWSVWb1ItRL
definition: A Motion for Royalty is a formal request made to a trial court for compensation or ongoing payment for the use of intellectual property.