D.C. Board on Professional Responsibility
type: Class
subclass of: R16E44cA98bb827F808ADdfd
definition: The D.C. Board on Professional Responsibility is a disciplinary body within the District of Columbia Courts that oversees the conduct of lawyers practicing in the District of Columbia.