Liquor Law Violations
type: Class
alternative label: 酒类法规违规行为
subclass of: RCqBiJAwLT5iG2nvk12tNKW
definition: The violation of laws or ordinances prohibiting the manufacture, sale, purchase, transportation, possession, or use of alcoholic beverages.